{"text_format":"1","workbook":"xlsx","n_sheets":10,"sheets":["Entête","Révisions","ResumeBatiment","Encodage","Resumé","G_Elec","G_Combustible","G_Eau","Paramètres","JBV"],"not_rendered":{"charts":27,"images":4,"macros":1,"external_links":0,"defined_names":21,"comments":2,"pivot_tables":1},"unopened":[],"bounds":{"document_bytes":16777216,"sheet_cells":100000,"rows_first":2000,"rows_last":500,"rows_between":2000,"halvings":0,"cell_chars":16384,"cell_head_chars":4096},"cells_cut":0,"cells_raw":0,"read":"whole","date_system":"1900"}

{"sheet":"Entête","index":0,"n_rows":15,"n_cols":7,"rows_kept":15,"cut":false,"hidden":false,"merged":[[28,1,28,4],[17,2,17,3],[2,1,2,3],[11,2,11,3],[13,2,13,3],[14,2,14,3],[15,2,15,3]]}
[]
[]
[]
[null,null,null,null,null,null,"                                          "]
[]
[]
[]
[]
[]
[]
[]
[null,null,"Facilitateur URE de Wallonie"]
[]
[null,null,"Outil"]
[null,null,"Modèle de cadastre énergétique"]

{"sheet":"Révisions","index":1,"n_rows":44,"n_cols":6,"rows_kept":44,"cut":false,"hidden":true,"merged":[[1,1,1,5]]}
[]
[null,"REVISIONS"]
[null,"Rév.","Date","Auteur","Objet","Pères"]
[null,0,{"$f":"Entête!C21","v":"00:00:00"},"JBV","Création"]
[null,1]
[null,2]
[null,3]
[null,4]
[null,5]
[null,6]
[null,7]
[null,8]
[null,9]
[null,10]
[null,11]
[null,12]
[null,13]
[null,14]
[null,15]
[null,16]
{"$rows_left_out":25}
{"sheet":"ResumeBatiment","index":2,"n_rows":10,"n_cols":9,"rows_kept":10,"cut":false,"hidden":true,"merged":[]}
["Batiment","(Tous)"]
[]
[null,"Étiquettes de colonnes"]
["Valeurs",2010,2011,2012,2013,2014,2015,2016,2017]
["Somme de Electricité ",318905.99600000004,312719.99399999995,317661.99,316139.99200000003,0,0,0,0]
["Somme de Electricité Heures pleines",0,0,0,0,0,0,0,0]
["Somme de Electricité Heures creuses",0,0,0,0,0,0,0,0]
["Somme de Cons spéc d'électricité",244.0846845526776,239.35003762688407,243.13254800079363,241.96763772815893,0,0,0,0]
["Somme de Cons spéc d'électricité moy du secteur",100,100,100,100,100,100,100,100]
["Somme de Combustible ",1864875.6,1631164.2101999999,1787578.7999999998,1796355.96,0,0,0,0]

{"sheet":"Encodage","index":3,"n_rows":132,"n_cols":30,"rows_kept":132,"cut":false,"hidden":false,"merged":[[11,1,11,6]]}
["Encodage des données et des factures"]
[]
["Année du 1er encodage:",null,null,2013]
["Choix de degrés jours:",null,null,"16,5/16,5"]
["Secteur général:",null,null,"à encoder"]
["Nombre de bâtiments:",null,null,12]
[]
[null,"Aller à    --->",{"$f":"A13","v":2013},{"$f":"C8+1","v":2014},2015,2016,2017,2018,{"$f":"H8+1","v":2019},{"$f":"I8+1","v":2020}]
[]
[null,null,"Surface chauffée","Affectation du bâtiment","Horaires d'occupation du bâtiment","Electricité (monhoraire)","Electricité Heures pleines","Electricité Heures creuses","Usage énergétique spécifique","Energies renouvelables",{"$f":"Paramètres!$F$3","v":"gaz naturel"},{"$f":"Paramètres!$F$4","v":"gasoil"},{"$f":"Paramètres!$F$5","v":"propane"},{"$f":"Paramètres!$F$6","v":"colza"},{"$f":"Paramètres!$F$7","v":"pellets"},{"$f":"Paramètres!$F$8","v":"Autres"},"Eau","Evol conso Eau par rapport année précédente","Electricité \n(total)","Evol conso Elec par rapport année précédente","Cons spéc d'électricité","Cons spéc d'électricité moy du secteur","Combustible \n(total)","% de normali\n-sation","Combustible\n(total) \nnormalisé","Cons spéc normalisée de combustible par rapport à l'année précédente","Cons spéc \nnormalisée \nde combustible","Cons spéc chauffage moy du secteur","Cons spéc normalisée de combustible en % de l'année de réf","Potentiel d'économie de combustible"]
[null,"Nom du bâtiment ","m²",null,null,"kWh","kWh","kWh",null,null,{"$f":"Paramètres!$G$3","v":"kWh"},{"$f":"Paramètres!$G$4","v":"litre"},{"$f":"Paramètres!$G$5","v":"m³"},{"$f":"Paramètres!$G$6","v":"litre"},{"$f":"Paramètres!$G$7","v":"kg"},{"$f":"Paramètres!$G$8","v":"kWh"},"m³","%","kWh","%","kWh/m²","kWh/m²","kWh",null,"kWh","%","kWh/m²","kWhp/m²","%","kWh²/m²"]
[null,"Pour visualiser un bâtiment sur plusieurs années : sélectionner-le  avec la flèche  -->"]
[{"$f":"D3","v":2013}]
["Année","Batiment",3,4,5,7,{"$f":"G10","v":"Electricité Heures pleines"},{"$f":"H10","v":"Electricité Heures creuses"},10,{"$f":"J10","v":"Energies renouvelables"},11,12,13,14,15,16,17,18,{"$f":"S10","v":"Electricité \n(total)"},21,"Cons spéc d'électricité","Cons spéc d'électricité moy du secteur","Combustible \n(total)",null,"Combustible\n(total) \nnormalisé",22,"Cons spéc \nnormalisée \nde combustible","Cons spéc chauffage moy du secteur","Cons spéc normalisée de combustible en % de l'année de réf",{"$f":"AD10","v":"Potentiel d'économie de combustible"}]
[{"$f":"A13","v":2013},"Batiment 1",null,"A sélectionner dans la liste déroulante",null,null,null,null,"à encoder","à encoder",null,null,null,null,null,null,null,{"$f":"IFERROR(1-Q15/Q15,0)","v":0},{"$f":"IF(F15<>0,F15,G15+H15)","v":0},{"$f":"IF(S15=0,0,S15/S15-1)","v":0},{"$f":"S15/C15","v":{"$error":"#DIV/0!"}},{"$f":"VLOOKUP(D15,Paramètres!$A$15:$D$26,3)","v":0},{"$f":"K15*Paramètres!$H$3+L15*Paramètres!$H$4+Encodage!M15*Paramètres!$H$5+Encodage!N15*Paramètres!$H$6+Encodage!O15*Paramètres!$H$7+P15*Paramètres!$H$8","v":0},{"$f":"VLOOKUP(D15,Paramètres!$A$15:$E$26,5)","v":1},{"$f":"W15*(1-X15)+(W15*X15*Paramètres!$D$3/VLOOKUP(Encodage!A15,Paramètres!$A$2:$D$15,4))","v":0},{"$f":"IF(Y15=0,0,Y15/Y15-1)","v":0},{"$f":"Y15/C15","v":{"$error":"#DIV/0!"}},{"$f":"VLOOKUP(D15,Paramètres!$A$15:$D$26,2)","v":0},{"$f":"AA15/AA$15","v":{"$error":"#DIV/0!"}},{"$f":"Y15*AA15","v":{"$error":"#DIV/0!"}}]
[{"$f":"A13","v":2013},"Batiment 2",null,"A sélectionner dans la liste déroulante",null,null,null,null,"à encoder","à encoder",null,null,null,null,null,null,null,{"$f":"IFERROR(Q16/Q16-1,0)","v":0},0,{"$f":"IF(S16=0,0,S16/S16-1)","v":0},{"$error":"#DIV/0!"},{"$f":"VLOOKUP(D16,Paramètres!$A$15:$D$26,3)","v":0},{"$f":"K16*Paramètres!$H$3+L16*Paramètres!$H$4+Encodage!M16*Paramètres!$H$5+Encodage!N16*Paramètres!$H$6+Encodage!O16*Paramètres!$H$7+P16*Paramètres!$H$8","v":0},{"$f":"VLOOKUP(D16,Paramètres!$A$15:$E$26,5)","v":1},{"$f":"W16*(1-X16)+(W16*X16*Paramètres!$D$3/VLOOKUP(Encodage!A16,Paramètres!$A$2:$D$15,4))","v":0},{"$f":"IF(Y16=0,0,Y16/Y16-1)","v":0},{"$error":"#DIV/0!"},{"$f":"VLOOKUP(D16,Paramètres!$A$15:$D$26,2)","v":0},{"$f":"AA16/AA$16","v":{"$error":"#DIV/0!"}},{"$error":"#DIV/0!"}]
[{"$f":"A16","v":2013},"Batiment 3",null,"A sélectionner dans la liste déroulante",null,null,null,null,"à encoder","à encoder",null,null,null,null,null,null,null,0,0,0,{"$error":"#DIV/0!"},{"$f":"VLOOKUP(D17,Paramètres!$A$15:$D$26,3)","v":0},{"$f":"K17*Paramètres!$H$3+L17*Paramètres!$H$4+Encodage!M17*Paramètres!$H$5+Encodage!N17*Paramètres!$H$6+Encodage!O17*Paramètres!$H$7+P17*Paramètres!$H$8","v":0},{"$f":"VLOOKUP(D17,Paramètres!$A$15:$E$26,5)","v":1},{"$f":"W17*(1-X17)+(W17*X17*Paramètres!$D$3/VLOOKUP(Encodage!A17,Paramètres!$A$2:$D$15,4))","v":0},0,{"$error":"#DIV/0!"},{"$f":"VLOOKUP(D17,Paramètres!$A$15:$D$26,2)","v":0},{"$f":"AA17/AA$17","v":{"$error":"#DIV/0!"}},{"$error":"#DIV/0!"}]
[2013,"Batiment 4",null,"A sélectionner dans la liste déroulante",null,null,null,null,"à encoder","à encoder",null,null,null,null,null,null,null,0,0,0,{"$error":"#DIV/0!"},{"$f":"VLOOKUP(D18,Paramètres!$A$15:$D$26,3)","v":0},{"$f":"K18*Paramètres!$H$3+L18*Paramètres!$H$4+Encodage!M18*Paramètres!$H$5+Encodage!N18*Paramètres!$H$6+Encodage!O18*Paramètres!$H$7+P18*Paramètres!$H$8","v":0},{"$f":"VLOOKUP(D18,Paramètres!$A$15:$E$26,5)","v":1},{"$f":"W18*(1-X18)+(W18*X18*Paramètres!$D$3/VLOOKUP(Encodage!A18,Paramètres!$A$2:$D$15,4))","v":0},0,{"$error":"#DIV/0!"},{"$f":"VLOOKUP(D18,Paramètres!$A$15:$D$26,2)","v":0},{"$f":"AA18/AA$18","v":{"$error":"#DIV/0!"}},{"$error":"#DIV/0!"}]
[2013,"Batiment 5",null,"A sélectionner dans la liste déroulante",null,null,null,null,"à encoder","à encoder",null,null,null,null,null,null,null,0,0,0,{"$error":"#DIV/0!"},{"$f":"VLOOKUP(D19,Paramètres!$A$15:$D$26,3)","v":0},{"$f":"K19*Paramètres!$H$3+L19*Paramètres!$H$4+Encodage!M19*Paramètres!$H$5+Encodage!N19*Paramètres!$H$6+Encodage!O19*Paramètres!$H$7+P19*Paramètres!$H$8","v":0},{"$f":"VLOOKUP(D19,Paramètres!$A$15:$E$26,5)","v":1},{"$f":"W19*(1-X19)+(W19*X19*Paramètres!$D$3/VLOOKUP(Encodage!A19,Paramètres!$A$2:$D$15,4))","v":0},0,{"$error":"#DIV/0!"},{"$f":"VLOOKUP(D19,Paramètres!$A$15:$D$26,2)","v":0},{"$f":"AA19/AA$19","v":{"$error":"#DIV/0!"}},{"$error":"#DIV/0!"}]
[2013,"Batiment 6",null,"A sélectionner dans la liste déroulante",null,null,null,null,"à encoder","à encoder",null,null,null,null,null,null,null,0,0,0,{"$error":"#DIV/0!"},{"$f":"VLOOKUP(D20,Paramètres!$A$15:$D$26,3)","v":0},{"$f":"K20*Paramètres!$H$3+L20*Paramètres!$H$4+Encodage!M20*Paramètres!$H$5+Encodage!N20*Paramètres!$H$6+Encodage!O20*Paramètres!$H$7+P20*Paramètres!$H$8","v":0},{"$f":"VLOOKUP(D20,Paramètres!$A$15:$E$26,5)","v":1},{"$f":"W20*(1-X20)+(W20*X20*Paramètres!$D$3/VLOOKUP(Encodage!A20,Paramètres!$A$2:$D$15,4))","v":0},0,{"$error":"#DIV/0!"},{"$f":"VLOOKUP(D20,Paramètres!$A$15:$D$26,2)","v":0},{"$f":"AA20/AA$20","v":{"$error":"#DIV/0!"}},{"$error":"#DIV/0!"}]
{"$rows_left_out":113}
{"sheet":"Resumé","index":4,"n_rows":34,"n_cols":9,"rows_kept":34,"cut":false,"hidden":false,"merged":[]}
["Evolution des consommations totales de tous les bâtiments"]
[]
[null,{"$f":"Encodage!D3","v":2013},{"$f":"B3+1","v":2014},2015,2016,2017,2018,2019,2020]
[{"$f":"JBV!A2","v":"Elec Tot"},{"$f":"HLOOKUP(B$3,JBV!$B$1:$I$12,2)","v":0},{"$f":"HLOOKUP(C$3,JBV!$B$1:$I$12,2)","v":0},{"$f":"HLOOKUP(D$3,JBV!$B$1:$I$12,2)","v":0},{"$f":"HLOOKUP(E$3,JBV!$B$1:$I$12,2)","v":0},{"$f":"HLOOKUP(F$3,JBV!$B$1:$I$12,2)","v":0},{"$f":"HLOOKUP(G$3,JBV!$B$1:$I$12,2)","v":0},{"$f":"HLOOKUP(H$3,JBV!$B$1:$I$12,2)","v":0},{"$f":"HLOOKUP(I$3,JBV!$B$1:$I$12,2)","v":0}]
[{"$f":"JBV!A3","v":"Elec heures pleines"},{"$f":"HLOOKUP(B$3,JBV!$B$1:$I$12,3)","v":0},{"$f":"HLOOKUP(C$3,JBV!$B$1:$I$12,3)","v":0},{"$f":"HLOOKUP(D$3,JBV!$B$1:$I$12,3)","v":0},{"$f":"HLOOKUP(E$3,JBV!$B$1:$I$12,3)","v":0},{"$f":"HLOOKUP(F$3,JBV!$B$1:$I$12,3)","v":0},{"$f":"HLOOKUP(G$3,JBV!$B$1:$I$12,3)","v":0},{"$f":"HLOOKUP(H$3,JBV!$B$1:$I$12,3)","v":0},{"$f":"HLOOKUP(I$3,JBV!$B$1:$I$12,3)","v":0}]
[{"$f":"JBV!A4","v":"Elec heures creuses"},{"$f":"HLOOKUP(B$3,JBV!$B$1:$I$12,4)","v":0},{"$f":"HLOOKUP(C$3,JBV!$B$1:$I$12,4)","v":0},{"$f":"HLOOKUP(D$3,JBV!$B$1:$I$12,4)","v":0},{"$f":"HLOOKUP(E$3,JBV!$B$1:$I$12,4)","v":0},{"$f":"HLOOKUP(F$3,JBV!$B$1:$I$12,4)","v":0},{"$f":"HLOOKUP(G$3,JBV!$B$1:$I$12,4)","v":0},{"$f":"HLOOKUP(H$3,JBV!$B$1:$I$12,4)","v":0},{"$f":"HLOOKUP(I$3,JBV!$B$1:$I$12,4)","v":0}]
[{"$f":"JBV!A5","v":"Consommation élect spécifique"},{"$f":"HLOOKUP(B$3,JBV!$B$1:$I$12,5)","v":{"$error":"#DIV/0!"}},{"$f":"HLOOKUP(C$3,JBV!$B$1:$I$12,5)","v":{"$error":"#DIV/0!"}},{"$f":"HLOOKUP(D$3,JBV!$B$1:$I$12,5)","v":{"$error":"#DIV/0!"}},{"$f":"HLOOKUP(E$3,JBV!$B$1:$I$12,5)","v":{"$error":"#DIV/0!"}},{"$f":"HLOOKUP(F$3,JBV!$B$1:$I$12,5)","v":{"$error":"#DIV/0!"}},{"$f":"HLOOKUP(G$3,JBV!$B$1:$I$12,5)","v":{"$error":"#DIV/0!"}},{"$f":"HLOOKUP(H$3,JBV!$B$1:$I$12,5)","v":{"$error":"#DIV/0!"}},{"$f":"HLOOKUP(I$3,JBV!$B$1:$I$12,5)","v":{"$error":"#DIV/0!"}}]
[{"$f":"JBV!A6","v":{"$error":"#N/A"}},{"$f":"HLOOKUP(B$3,JBV!$B$1:$I$12,6)","v":{"$error":"#N/A"}},{"$f":"HLOOKUP(C$3,JBV!$B$1:$I$12,6)","v":{"$error":"#N/A"}},{"$f":"HLOOKUP(D$3,JBV!$B$1:$I$12,6)","v":{"$error":"#N/A"}},{"$f":"HLOOKUP(E$3,JBV!$B$1:$I$12,6)","v":{"$error":"#N/A"}},{"$f":"HLOOKUP(F$3,JBV!$B$1:$I$12,6)","v":{"$error":"#N/A"}},{"$f":"HLOOKUP(G$3,JBV!$B$1:$I$12,6)","v":{"$error":"#N/A"}},{"$f":"HLOOKUP(H$3,JBV!$B$1:$I$12,6)","v":{"$error":"#N/A"}},{"$f":"HLOOKUP(I$3,JBV!$B$1:$I$12,6)","v":{"$error":"#N/A"}}]
[{"$f":"JBV!A7","v":"Consommation de combustibles"},{"$f":"HLOOKUP(B$3,JBV!$B$1:$I$12,7)","v":0},{"$f":"HLOOKUP(C$3,JBV!$B$1:$I$12,7)","v":0},{"$f":"HLOOKUP(D$3,JBV!$B$1:$I$12,7)","v":0},{"$f":"HLOOKUP(E$3,JBV!$B$1:$I$12,7)","v":0},{"$f":"HLOOKUP(F$3,JBV!$B$1:$I$12,7)","v":0},{"$f":"HLOOKUP(G$3,JBV!$B$1:$I$12,7)","v":0},{"$f":"HLOOKUP(H$3,JBV!$B$1:$I$12,7)","v":0},{"$f":"HLOOKUP(I$3,JBV!$B$1:$I$12,7)","v":0}]
[{"$f":"JBV!A8","v":"Consommation de combustible normalisé"},{"$f":"HLOOKUP(B$3,JBV!$B$1:$I$12,8)","v":0},{"$f":"HLOOKUP(C$3,JBV!$B$1:$I$12,8)","v":0},{"$f":"HLOOKUP(D$3,JBV!$B$1:$I$12,8)","v":{"$error":"#DIV/0!"}},{"$f":"HLOOKUP(E$3,JBV!$B$1:$I$12,8)","v":{"$error":"#DIV/0!"}},{"$f":"HLOOKUP(F$3,JBV!$B$1:$I$12,8)","v":{"$error":"#DIV/0!"}},{"$f":"HLOOKUP(G$3,JBV!$B$1:$I$12,8)","v":{"$error":"#DIV/0!"}},{"$f":"HLOOKUP(H$3,JBV!$B$1:$I$12,8)","v":{"$error":"#DIV/0!"}},{"$f":"HLOOKUP(I$3,JBV!$B$1:$I$12,8)","v":{"$error":"#DIV/0!"}}]
[{"$f":"JBV!A9","v":"Consommation combustible spécifique normalisée"},{"$f":"HLOOKUP(B$3,JBV!$B$1:$I$12,9)","v":{"$error":"#DIV/0!"}},{"$f":"HLOOKUP(C$3,JBV!$B$1:$I$12,9)","v":{"$error":"#DIV/0!"}},{"$f":"HLOOKUP(D$3,JBV!$B$1:$I$12,9)","v":{"$error":"#DIV/0!"}},{"$f":"HLOOKUP(E$3,JBV!$B$1:$I$12,9)","v":{"$error":"#DIV/0!"}},{"$f":"HLOOKUP(F$3,JBV!$B$1:$I$12,9)","v":{"$error":"#DIV/0!"}},{"$f":"HLOOKUP(G$3,JBV!$B$1:$I$12,9)","v":{"$error":"#DIV/0!"}},{"$f":"HLOOKUP(H$3,JBV!$B$1:$I$12,9)","v":{"$error":"#DIV/0!"}},{"$f":"HLOOKUP(I$3,JBV!$B$1:$I$12,9)","v":{"$error":"#DIV/0!"}}]
[{"$f":"JBV!A10","v":{"$error":"#N/A"}},{"$f":"HLOOKUP(B$3,JBV!$B$1:$I$12,10)","v":{"$error":"#N/A"}},{"$f":"HLOOKUP(C$3,JBV!$B$1:$I$12,10)","v":{"$error":"#N/A"}},{"$f":"HLOOKUP(D$3,JBV!$B$1:$I$12,10)","v":{"$error":"#N/A"}},{"$f":"HLOOKUP(E$3,JBV!$B$1:$I$12,10)","v":{"$error":"#N/A"}},{"$f":"HLOOKUP(F$3,JBV!$B$1:$I$12,10)","v":{"$error":"#N/A"}},{"$f":"HLOOKUP(G$3,JBV!$B$1:$I$12,10)","v":{"$error":"#N/A"}},{"$f":"HLOOKUP(H$3,JBV!$B$1:$I$12,10)","v":{"$error":"#N/A"}},{"$f":"HLOOKUP(I$3,JBV!$B$1:$I$12,10)","v":{"$error":"#N/A"}}]
[{"$f":"JBV!A11","v":"Degrés jours16,5/16,5"},{"$f":"HLOOKUP(B$3,JBV!$B$1:$I$12,11)","v":2537},{"$f":"HLOOKUP(C$3,JBV!$B$1:$I$12,11)","v":1828},{"$f":"HLOOKUP(D$3,JBV!$B$1:$I$12,11)","v":0},{"$f":"HLOOKUP(E$3,JBV!$B$1:$I$12,11)","v":0},{"$f":"HLOOKUP(F$3,JBV!$B$1:$I$12,11)","v":0},{"$f":"HLOOKUP(G$3,JBV!$B$1:$I$12,11)","v":0},{"$f":"HLOOKUP(H$3,JBV!$B$1:$I$12,11)","v":0},{"$f":"HLOOKUP(I$3,JBV!$B$1:$I$12,11)","v":0}]
[{"$f":"JBV!A12","v":"Eau en m³"},{"$f":"HLOOKUP(B$3,JBV!$B$1:$I$12,12)","v":0},{"$f":"HLOOKUP(C$3,JBV!$B$1:$I$12,12)","v":0},{"$f":"HLOOKUP(D$3,JBV!$B$1:$I$12,12)","v":0},{"$f":"HLOOKUP(E$3,JBV!$B$1:$I$12,12)","v":0},{"$f":"HLOOKUP(F$3,JBV!$B$1:$I$12,12)","v":0},{"$f":"HLOOKUP(G$3,JBV!$B$1:$I$12,12)","v":0},{"$f":"HLOOKUP(H$3,JBV!$B$1:$I$12,12)","v":0},{"$f":"HLOOKUP(I$3,JBV!$B$1:$I$12,12)","v":0}]
[]
["Evolution par rapport à l’année du 1er encodage",{"$f":"B3","v":2013},2014,2015,2016,2017,2018,2019,2020]
[{"$f":"A4","v":"Elec Tot"},{"$f":"B4/$B4","v":{"$error":"#DIV/0!"}},{"$f":"C4/$B4","v":{"$error":"#DIV/0!"}},{"$error":"#DIV/0!"},{"$error":"#DIV/0!"},{"$error":"#DIV/0!"},{"$error":"#DIV/0!"},{"$error":"#DIV/0!"},{"$error":"#DIV/0!"}]
[{"$f":"A5","v":"Elec heures pleines"},{"$f":"IFERROR(B5/$B5,\"NA\")","v":"NA"},{"$f":"IFERROR(C5/$B5,\"NA\")","v":"NA"},"NA","NA","NA","NA","NA","NA"]
["Elec heures creuses",{"$f":"IFERROR(B6/$B6,\"NA\")","v":"NA"},"NA","NA","NA","NA","NA","NA","NA"]
[{"$f":"A9","v":"Consommation de combustibles"},{"$f":"B9/$B9","v":{"$error":"#DIV/0!"}},{"$error":"#DIV/0!"},{"$error":"#DIV/0!"},{"$error":"#DIV/0!"},{"$error":"#DIV/0!"},{"$error":"#DIV/0!"},{"$error":"#DIV/0!"},{"$error":"#DIV/0!"}]
{"$rows_left_out":15}
{"sheet":"G_Elec","index":5,"n_rows":106,"n_cols":17,"rows_kept":106,"cut":false,"hidden":false,"merged":[[81,0,81,5],[81,6,81,10],[81,11,81,15],[81,16,81,20],[82,0,82,5],[82,6,82,10],[82,11,82,15],[82,16,82,20],[104,16,104,20],[105,16,105,20],[104,0,104,5],[104,6,104,10],[105,0,105,5],[105,6,105,10],[104,11,104,15],[105,11,105,15]]}
[]
[]
[]
[]
[]
[]
[]
[]
[]
[]
[]
[]
[]
[]
[]
[]
[]
[]
[]
[]
{"$rows_left_out":87}
{"sheet":"G_Combustible","index":6,"n_rows":0,"n_cols":0,"rows_kept":0,"cut":false,"hidden":false,"merged":[[40,0,40,5],[40,6,40,10],[59,6,59,10]]}

{"sheet":"G_Eau","index":7,"n_rows":0,"n_cols":0,"rows_kept":0,"cut":false,"hidden":false,"merged":[[21,0,21,5],[21,6,21,10]]}

{"sheet":"Paramètres","index":8,"n_rows":52,"n_cols":11,"rows_kept":52,"cut":false,"hidden":false,"merged":[]}
["Degrés jours",null,null,null,null,"Coefficients de conversion:",null,null,null,null,"Usage énergétique"]
[null,"15/15","16,5/16,5",{"$f":"IF(Encodage!$D$4=$B$2,B2,C2)","v":"16,5/16,5"},null,"Electricité","kWh",2.5,{"$f":"\"kWhp\"&\"/\"&G2","v":"kWhp/kWh"},null,"Chauffage"]
["réf",1913,2344,{"$f":"IF(Encodage!$D$4=$B$2,B3,C3)","v":2344},null,"gaz naturel","kWh",0.90300000000000002,"kWhp/kWh",null,"Eau chaude sanitaire (ECS)"]
[2009,1819.7,2212,{"$f":"IF(Encodage!$D$4=$B$2,B4,C4)","v":2212},null,"gasoil","litre",{"$f":"36500/3600","v":10.138888888888889},"kWhp/litre",null,"Cuisine"]
[2010,2309,2703,{"$f":"IF(Encodage!$D$4=$B$2,B5,C5)","v":2703},null,"propane","m³",6.5555555555555554,"kWhp/m³",null,"Ch + ECS"]
[2011,1514.5,1928,{"$f":"IF(Encodage!$D$4=$B$2,B6,C6)","v":1928},null,"colza","litre",10.744444444444444,"kWhp/litre",null,"Ch + cuisine"]
[2012,1914.7,2327,{"$f":"IF(Encodage!$D$4=$B$2,B7,C7)","v":2327},null,"pellets","kg",4,"kWhp/kg",null,"ECS + Cuisine"]
[2013,2137.6999999999998,2537,{"$f":"IF(Encodage!$D$4=$B$2,B8,C8)","v":2537},null,"Autres","kWh",1,"kWhp/kWh",null,"Ch + ECS + Cuisine"]
[2014,1424.1,1828,{"$f":"IF(Encodage!$D$4=$B$2,B9,C9)","v":1828},null,null,null,null,null,null,"cuisine collective"]
[2015,null,null,{"$f":"IF(Encodage!$D$4=$B$2,B10,C10)","v":0},null,null,null,null,null,null,"air-conditionné"]
[2016,null,null,{"$f":"IF(Encodage!$D$4=$B$2,B11,C11)","v":0},null,null,null,null,null,null,"chauffage électrique"]
[null,null,null,null,null,null,null,null,null,null,"piscine"]
["Consommation moyenne du secteur"]
[null,"Chauffage","Elec",null,"Rapport Normalisation"]
["A sélectionner dans la liste déroulante",0,0,"kWh/m²",1]
["Accueil de jour",0,0,"kWh/m²",1]
["Bureau",0,0,"kWh/m²",1]
["Centre d’insertion socio-professionnel",0,0,"kWh/m²",1]
["Crèche",0,0,"kWh/m²",1]
["École",0,0,"kWh/m²",1]
{"$rows_left_out":33}
{"sheet":"JBV","index":9,"n_rows":12,"n_cols":9,"rows_kept":12,"cut":false,"hidden":true,"merged":[]}
[null,{"$f":"Encodage!A27","v":2013},{"$f":"Encodage!A42","v":2014},{"$f":"Encodage!A57","v":2015},{"$f":"D1+1","v":2016},{"$f":"E1+1","v":2017},{"$f":"F1+1","v":2018},{"$f":"G1+1","v":2019},{"$f":"H1+1","v":2020}]
["Elec Tot",{"$f":"Encodage!$S27","v":0},{"$f":"Encodage!S42","v":0},{"$f":"Encodage!S57","v":0},{"$f":"Encodage!$S72","v":0},{"$f":"Encodage!$S87","v":0},{"$f":"Encodage!$S102","v":0},{"$f":"Encodage!$S117","v":0},{"$f":"Encodage!$S132","v":0}]
["Elec heures pleines",{"$f":"Encodage!$G27","v":0},{"$f":"Encodage!G42","v":0},{"$f":"Encodage!G57","v":0},{"$f":"Encodage!$G72","v":0},{"$f":"Encodage!$G87","v":0},{"$f":"Encodage!$G102","v":0},{"$f":"Encodage!$G117","v":0},{"$f":"Encodage!$G132","v":0}]
["Elec heures creuses",{"$f":"Encodage!$H27","v":0},{"$f":"Encodage!H42","v":0},{"$f":"Encodage!H57","v":0},{"$f":"Encodage!$H72","v":0},{"$f":"Encodage!$H87","v":0},{"$f":"Encodage!$H102","v":0},{"$f":"Encodage!$H117","v":0},{"$f":"Encodage!$H132","v":0}]
["Consommation élect spécifique",{"$f":"Encodage!$U27","v":{"$error":"#DIV/0!"}},{"$f":"Encodage!U42","v":{"$error":"#DIV/0!"}},{"$f":"Encodage!U57","v":{"$error":"#DIV/0!"}},{"$f":"Encodage!$U72","v":{"$error":"#DIV/0!"}},{"$f":"Encodage!$U87","v":{"$error":"#DIV/0!"}},{"$f":"Encodage!$U102","v":{"$error":"#DIV/0!"}},{"$f":"Encodage!$U117","v":{"$error":"#DIV/0!"}},{"$f":"Encodage!$U132","v":{"$error":"#DIV/0!"}}]
[{"$f":"\"Consommation moyenne du secteur = \"&B6&\" kWh/m²\"","v":{"$error":"#N/A"}},{"$f":"VLOOKUP(Encodage!D5,Paramètres!$A$15:$D$26,3)","v":{"$error":"#N/A"}},{"$f":"$B$6","v":{"$error":"#N/A"}},{"$f":"$B$6","v":{"$error":"#N/A"}},{"$error":"#N/A"},{"$error":"#N/A"},{"$error":"#N/A"},{"$error":"#N/A"},{"$error":"#N/A"}]
["Consommation de combustibles",{"$f":"Encodage!$W27","v":0},{"$f":"Encodage!W42","v":0},{"$f":"Encodage!W57","v":0},{"$f":"Encodage!$W72","v":0},{"$f":"Encodage!$W87","v":0},{"$f":"Encodage!$W102","v":0},{"$f":"Encodage!$W117","v":0},{"$f":"Encodage!$W132","v":0}]
["Consommation de combustible normalisé",{"$f":"Encodage!$Y27","v":0},{"$f":"Encodage!$Y42","v":0},{"$f":"Encodage!$Y57","v":{"$error":"#DIV/0!"}},{"$f":"Encodage!$Y72","v":{"$error":"#DIV/0!"}},{"$f":"Encodage!$Y87","v":{"$error":"#DIV/0!"}},{"$f":"Encodage!$Y102","v":{"$error":"#DIV/0!"}},{"$f":"Encodage!$Y117","v":{"$error":"#DIV/0!"}},{"$f":"Encodage!$Y132","v":{"$error":"#DIV/0!"}}]
["Consommation combustible spécifique normalisée",{"$f":"Encodage!$AA27","v":{"$error":"#DIV/0!"}},{"$f":"Encodage!AA42","v":{"$error":"#DIV/0!"}},{"$f":"Encodage!AA57","v":{"$error":"#DIV/0!"}},{"$f":"Encodage!$AA72","v":{"$error":"#DIV/0!"}},{"$f":"Encodage!$AA87","v":{"$error":"#DIV/0!"}},{"$f":"Encodage!$AA102","v":{"$error":"#DIV/0!"}},{"$f":"Encodage!$AA117","v":{"$error":"#DIV/0!"}},{"$f":"Encodage!$AA132","v":{"$error":"#DIV/0!"}}]
[{"$f":"\"Consommation moyenne du secteur = \"&B10&\" kWh/m²\"","v":{"$error":"#N/A"}},{"$f":"VLOOKUP(Encodage!D5,Paramètres!$A$15:$D$26,2)","v":{"$error":"#N/A"}},{"$f":"$B$10","v":{"$error":"#N/A"}},{"$f":"$B$10","v":{"$error":"#N/A"}},{"$error":"#N/A"},{"$error":"#N/A"},{"$error":"#N/A"},{"$error":"#N/A"},{"$error":"#N/A"}]
[{"$f":"Paramètres!A1&Paramètres!D2","v":"Degrés jours16,5/16,5"},{"$f":"VLOOKUP(B1,Paramètres!$A$4:$D$15,4)","v":2537},{"$f":"VLOOKUP(C1,Paramètres!$A$4:$D$15,4)","v":1828},{"$f":"VLOOKUP(D1,Paramètres!$A$4:$D$15,4)","v":0},{"$f":"VLOOKUP(E1,Paramètres!$A$4:$D$15,4)","v":0},{"$f":"VLOOKUP(F1,Paramètres!$A$4:$D$15,4)","v":0},{"$f":"VLOOKUP(G1,Paramètres!$A$4:$D$15,4)","v":0},{"$f":"VLOOKUP(H1,Paramètres!$A$4:$D$15,4)","v":0},{"$f":"VLOOKUP(I1,Paramètres!$A$4:$D$15,4)","v":0}]
["Eau en m³",{"$f":"Encodage!$Q27","v":0},{"$f":"Encodage!Q42","v":0},{"$f":"Encodage!Q57","v":0},{"$f":"Encodage!$Q72","v":0},{"$f":"Encodage!$Q87","v":0},{"$f":"Encodage!$Q102","v":0},{"$f":"Encodage!$Q117","v":0},{"$f":"Encodage!$Q132","v":0}]